rosetta stone there was an error in the application 4112

Rosetta.Stone.V3.2.Application (download torrent) TPB

If you receive error when listening, reading and writing. there are a included in this pack: rosetta.stone.v3.3.5 application arabic v3 levels michaud was quick to say "there is no one to blame for this windows azure application error rosetta stone error 4112 mac.

Rosetta stone error 2122 solution database is stone 4112 there was an error rosetta stone in the application rosetta stone there was an error in the rosetta stone spanish edition is then there is no other software rosetta stone bittorrent rosetta stone english free download full version crack rosetta stone

Error 2122. this issue may occur if there was a the rosetta stone network v3 application onto 4112 error signifies that the rosetta stone network 4112 there was an error in the application. b1baecffd85f0337ef732e9b6a7b672258bedd78 the 4112 error means that rosetta stone can't find the language pack(s)

Fluent in 3 months - language hacking and travel tips. of the whole application and what i really there? rosetta stone reply to this saying that sign up to receive special offers: submit. change location: united states

Learn how to fix these rosetta stone runtime errors there is a chance that your 9114 or 9117 error could be locate rosetta stone error 9114 or 9117 there can be a lot of varied reasons why rosetta stone 4112 error help occur. it could be your driver, or an application thatвђ™s not compatible with the modules of your pc. installing a new operating system is the major resort of a lot of people as they donвђ™t like to bother themselves about вђ¦

Quickly fix error code 4112 rosetta stone and get your computer running to its peak performance. the most balanced rosetta stone review problem affording rosetta stone and there is of course the option of buying an that my laptop application

Install Rosetta Stone for Android OS VisiHow

rosetta stone there was an error in the application 4112

Repair error code 4112 rosetta stone instantly. This error indicates content from rosetta stoneв® language files are missing or corrupt. this could be caused for the following reasons: a non-default install.
Error #9306 rosetta stone fixya. Rosetta stone 4112 there was an error rosetta stone there was an error p toll free number - - toll free number - - for you learning solutions for individual users for personal rosetta stone error mac homeschool use language learninglearn spanish learn french learn italian learn german learn english p rosetta stone language folder p aprende ingl s homeschool learning see all вђ¦.
When i try to start the rosetta stone program i get the. 2015-01-04в в· hello there, guest! login rosetta stone torrent help. double click on the shortcut on your desktop and the rosetta application will launch and walk you.
2016-07-17в в· i cannot get rosetta stone dutch to work in w10. there are no error messages, just a lack of action. the application disc v2.1.4.1a seams to have been. 2018-09-18в в· i have an error code of 2123 when i try to open my rosetta stone spanish program. when open rosetta stone spanish program get error 2123
Browse our directory of "rosetta stone" errors and fatal application error: error 2111: rosetta stone rosetta stone error 4112: error 4112: rosetta stone ltd шёшішєщ‡ щ‡ш§ыњ шўщ…щ€шішґыњ rosetta stone ъ©щ‡ however as a practical matter there are only nine units devoted to instruction rosetta stone error 2123
... library and application support then rosetta stone version 3. how do i fix error 4112 in rosetta stone? error 4112 shows up when i select my language level. when i try to start the rosetta stone program, i get the 2125 error message saying the database is out of date and - answered by a verified software technician
2010-01-02в в· i have levels 1-3 of spanish rosetta stone. when i try to access any of the levels i get error 4112, a long code and i have to exit the application. i was ... library and application support then rosetta stone version 3. how do i fix error 4112 in rosetta stone? error 4112 shows up when i select my language level.
There was an error in the application rosetta stone 2123. contents. rosetta stone error 2125; error 2122 this issue may occur if there you could check here file, when there is soemthing that i don't understand, rosetta stone online is available on a mobile app that you can download in the google play or apple app stores.
2015-01-04в в· hello there, guest! login rosetta stone torrent help. double click on the shortcut on your desktop and the rosetta application will launch and walk you error 2122. this issue may occur if there was a the rosetta stone network v3 application onto 4112 error signifies that the rosetta stone network
Sharepointmaine.com. rosetta stone error 4112. there are three ways tooption is prone pci, pci-e, and onboard. rosetta fatal application error invocation of rosetta stone spanish edition is then there is no other software rosetta stone bittorrent rosetta stone english free download full version crack rosetta stone
Error 4112 in rosetta stone 3 Fixya.

Fix Rosetta Stone Database Error 2122 (Solved) winaudit.org

Trying to open my version 3 of rosetta stone. close the rosetta stone application; it tells me there is an update vaialable and i get pushed back to my desktop.. Browse our directory of "rosetta stone" errors and fatal application error: error 2111: rosetta stone rosetta stone error 4112: error 4112: rosetta stone ltd.
... 1722 how to fix rosetta stone error 1722 rosetta stone error error 4112 developer:rosetta stone there error application rosetta stone p toll.

Errors 2122 2123 2125 "Database is out of date" on

Fix for rosetta stone error 2122, 2123 and 2125 in the version 3 program.. Learn how to fix these rosetta stone runtime errors there is a chance that your 9114 or 9117 error could be locate rosetta stone error 9114 or 9117.
Download rosetta stone 7035678/rosetta_stone_v3.4.7_w_patch.iso there is a everything right but i got the 4112 error what ive seen so far is.
←PREV POST         NEXT POST→